{"text_format":"1","workbook":"xlsx","n_sheets":5,"sheets":["Instructions","Enter County Regions","Enter Services Available","Enter Services Available Temp","Services Available to Customers"],"not_rendered":{"charts":0,"images":7,"macros":1,"external_links":0,"defined_names":0,"comments":0,"pivot_tables":0},"unopened":[],"bounds":{"document_bytes":16777216,"sheet_cells":100000,"rows_first":2000,"rows_last":500,"rows_between":2000,"halvings":0,"cell_chars":16384,"cell_head_chars":4096},"cells_cut":0,"cells_raw":0,"read":"whole","date_system":"1900"}

{"sheet":"Instructions","index":0,"n_rows":29,"n_cols":2,"rows_kept":29,"cut":false,"hidden":false,"merged":[]}
[null,"County Resource Map - This tool is designed to: \n• Help county senior staff take stock of services, activities and partnerships offered as part of their CalWORKs program, while also acknowledging possible gaps. \n• Provide supervisors, lead workers and frontline staff with a comprehensive menu of services, activities and referral resources available to each unique family they are serving. "]
[null,"Who should use this tool- (1) Management and Supervisor staff should complete initial set-up and quarterly updates to the tool \n                                                      (2) Frontline staff should regularly access this tool to review the full scope of possible activities and resources available to customers\n"]
[null,"County Resource Map Initial Set Up"]
[null,"1.       Make sure you click “Enable Content” on the yellow security banner if it pops up. Without this, the Resource Map will not work. "]
[null,"2.       Start in the “Enter County Regions” sheet."]
[null,"a.       Under “Number of county regions,” enter the number of regions the user would like to show different service offerings for. If the service offerings are the same across the county (or only one region will be featured), enter 1."]
[null,"b.      Click the “Update Region Count” button. If you entered 0 or 1 in the step above, then skip to step 3."]
[null,"c.       A banner and new button will appear, along with a number and box for each region to be entered. Under this new banner, “Names of county regions,” write the name of each region in each cell. "]
[null,"d.      Click the “Update Regions” button. This will create a new sheet for each region, and the name of each new sheet will be the name entered in during the previous step (2c)."]
[null,"3.       Move to either the \"Enter Services Available” sheet (if you only entered 1 region) or the first region specific sheet that was created."]
{"$rows_left_out":20}
{"sheet":"Enter County Regions","index":1,"n_rows":8,"n_cols":3,"rows_kept":8,"cut":false,"hidden":false,"merged":[]}
[]
[null,null,"Number of county regions"]
[null,null,0]
[]
[]
[]
[null,null,"Names of county regions"]
[null,{"$f":"\"1.\"","v":"1."}]

{"sheet":"Enter Services Available","index":2,"n_rows":246,"n_cols":7,"rows_kept":246,"cut":false,"hidden":false,"merged":[[162,3,162,6],[234,3,234,6],[174,3,174,6],[186,3,186,6],[198,3,198,6],[210,3,210,6],[222,3,222,6],[102,3,102,6],[114,3,114,6],[126,3,126,6],[138,3,138,6],[150,3,150,6],[42,3,42,6],[54,3,54,6],[66,3,66,6],[78,3,78,6],[90,3,90,6],[4,1,15,1],[16,1,23,1],[24,1,27,1],[28,1,33,1],[34,1,37,1]]}
[]
[]
[null,"Service category",null,"Services offered in county","Yes/No",null,"Number of Service Offerings"]
[]
["Yes","Employment",null,"Job Readiness","Yes",null,10]
["No"]
[null,null,null,"Job Search","Yes",null,10]
[]
[null,null,null,"Work Experience","Yes",null,10]
[]
{"$rows_left_out":237}
{"sheet":"Enter Services Available Temp","index":3,"n_rows":246,"n_cols":7,"rows_kept":246,"cut":false,"hidden":true,"merged":[[66,3,66,6],[78,3,78,6],[90,3,90,6],[42,3,42,6],[54,3,54,6],[4,1,15,1],[16,1,23,1],[24,1,27,1],[28,1,33,1],[34,1,37,1],[102,3,102,6],[114,3,114,6],[234,3,234,6],[162,3,162,6],[174,3,174,6],[186,3,186,6],[198,3,198,6],[210,3,210,6],[222,3,222,6],[150,3,150,6],[138,3,138,6],[126,3,126,6]]}
[]
[]
[null,"Service category",null,"Services offered in county","Yes/No",null,"Number of Service Offerings"]
[]
["Yes","Employment",null,"Job Readiness","Yes",null,10]
["No"]
[null,null,null,"Job Search","Yes",null,10]
[]
[null,null,null,"Work Experience","Yes",null,10]
[]
{"$rows_left_out":237}
{"sheet":"Services Available to Customers","index":4,"n_rows":13,"n_cols":21,"rows_kept":13,"cut":false,"hidden":false,"merged":[[7,10,8,10],[7,11,8,11],[10,10,10,11],[9,10,9,11],[2,10,3,10],[5,10,5,11],[6,3,6,4],[7,1,8,1],[3,4,3,5],[0,0,0,1],[4,1,5,1],[4,3,5,3],[4,5,4,7],[5,5,5,7],[2,1,3,1],[2,2,3,2],[2,4,2,5],[1,0,1,1],[0,2,0,10],[1,2,1,10],[2,0,3,0],[4,0,5,0],[9,0,10,0],[11,0,12,0],[7,0,8,0],[9,5,9,6],[10,2,10,4],[10,5,10,6],[11,1,12,1],[11,3,11,4],[12,3,12,4],[9,1,10,1],[9,2,9,4]]}
["Within 24 months",null,"Time on TANF for a single parent with no children under age 6. "]
["Region1",null,"County region"]
["Employment","Services/Activities","Barrier removal activities","Job Readiness","Job Search",null,"Work Experience","Community Service","Subsidized Employment","OJT","Unsubsidized Employment",null,null,null,null,null,null,null,null,null,"Within 24 months"]
[null,null,null,{"$f":"CONCATENATE(IF('Enter Services Available'!$E$5<>\"Yes\",\"\",IF('Enter Services Available'!D45<>\"\",CONCATENATE(CHAR(149),'Enter Services Available'!D45,IF('Enter Services Available'!D46<>\"\",CONCATENATE(CHAR(10),CHAR(149),'Enter Services Available'!D46,IF('Enter Services Available'!D47<>\"\",CONCATENATE(CHAR(10),CHAR(149),'Enter Services Available'!D47,IF('Enter Services Available'!D48<>\"\",CONCATENATE(CHAR(10),CHAR(149),'Enter Services Available'!D48,IF('Enter Services Available'!D49<>\"\",CONCATENATE(CHAR(10),CHAR(149),'Enter Services Available'!D49,IF('Enter Services Available'!D50<>\"\",CONCATENATE(CHAR(10),CHAR(149),'Enter Services Available'!D50,IF('Enter Services Available'!D51<>\"\",CONCATENATE(CHAR(10),CHAR(149),'Enter Services Available'!D51,IF('Enter Services Available'!D52<>\"\",CONCATENATE(CHAR(10),CHAR(149),'Enter Services Available'!D52,IF('Enter Services Available'!D53<>\"\",CONCATENATE(CHAR(10),CHAR(149),'Enter Services Available'!D53,IF('Enter Services Available'!D54<>\"\",CONCATENATE(CHAR(10),CHAR(149),'Enter Services Available'!D54),\"\")),\"\")),\"\")),\"\")),\"\")),\"\")),\"\")),\"\")),\"\")),\"\")))","v":""},{"$f":"CONCATENATE(IF('Enter Services Available'!$E$7<>\"Yes\",\"\",IF('Enter Services Available'!D57<>\"\",CONCATENATE(CHAR(149),'Enter Services Available'!D57,IF('Enter Services Available'!D58<>\"\",CONCATENATE(CHAR(10),CHAR(149),'Enter Services Available'!D58,IF('Enter Services Available'!D59<>\"\",CONCATENATE(CHAR(10),CHAR(149),'Enter Services Available'!D59,IF('Enter Services Available'!D60<>\"\",CONCATENATE(CHAR(10),CHAR(149),'Enter Services Available'!D60,IF('Enter Services Available'!D61<>\"\",CONCATENATE(CHAR(10),CHAR(149),'Enter Services Available'!D61,IF('Enter Services Available'!D62<>\"\",CONCATENATE(CHAR(10),CHAR(149),'Enter Services Available'!D62,IF('Enter Services Available'!D63<>\"\",CONCATENATE(CHAR(10),CHAR(149),'Enter Services Available'!D63,IF('Enter Services Available'!D64<>\"\",CONCATENATE(CHAR(10),CHAR(149),'Enter Services Available'!D64,IF('Enter Services Available'!D65<>\"\",CONCATENATE(CHAR(10),CHAR(149),'Enter Services Available'!D65,IF('Enter Services Available'!D66<>\"\",CONCATENATE(CHAR(10),CHAR(149),'Enter Services Available'!D66),\"\")),\"\")),\"\")),\"\")),\"\")),\"\")),\"\")),\"\")),\"\")),\"\")))","v":""},null,{"$f":"CONCATENATE(IF('Enter Services Available'!$E$9<>\"Yes\",\"\",IF('Enter Services Available'!D69<>\"\",CONCATENATE(CHAR(149),'Enter Services Available'!D69,IF('Enter Services Available'!D70<>\"\",CONCATENATE(CHAR(10),CHAR(149),'Enter Services Available'!D70,IF('Enter Services Available'!D71<>\"\",CONCATENATE(CHAR(10),CHAR(149),'Enter Services Available'!D71,IF('Enter Services Available'!D72<>\"\",CONCATENATE(CHAR(10),CHAR(149),'Enter Services Available'!D72,IF('Enter Services Available'!D73<>\"\",CONCATENATE(CHAR(10),CHAR(149),'Enter Services Available'!D73,IF('Enter Services Available'!D74<>\"\",CONCATENATE(CHAR(10),CHAR(149),'Enter Services Available'!D74,IF('Enter Services Available'!D75<>\"\",CONCATENATE(CHAR(10),CHAR(149),'Enter Services Available'!D75,IF('Enter Services Available'!D76<>\"\",CONCATENATE(CHAR(10),CHAR(149),'Enter Services Available'!D76,IF('Enter Services Available'!D77<>\"\",CONCATENATE(CHAR(10),CHAR(149),'Enter Services Available'!D77,IF('Enter Services Available'!D78<>\"\",CONCATENATE(CHAR(10),CHAR(149),'Enter Services Available'!D78),\"\")),\"\")),\"\")),\"\")),\"\")),\"\")),\"\")),\"\")),\"\")),\"\")))","v":""},{"$f":"CONCATENATE(IF('Enter Services Available'!$E$11<>\"Yes\",\"\",IF('Enter Services Available'!D81<>\"\",CONCATENATE(CHAR(149),'Enter Services Available'!D81,IF('Enter Services Available'!D82<>\"\",CONCATENATE(CHAR(10),CHAR(149),'Enter Services Available'!D82,IF('Enter Services Available'!D83<>\"\",CONCATENATE(CHAR(10),CHAR(149),'Enter Services Available'!D83,IF('Enter Services Available'!D84<>\"\",CONCATENATE(CHAR(10),CHAR(149),'Enter Services Available'!D84,IF('Enter Services Available'!D85<>\"\",CONCATENATE(CHAR(10),CHAR(149),'Enter Services Available'!D85,IF('Enter Services Available'!D86<>\"\",CONCATENATE(CHAR(10),CHAR(149),'Enter Services Available'!D86,IF('Enter Services Available'!D87<>\"\",CONCATENATE(CHAR(10),CHAR(149),'Enter Services Available'!D87,IF('Enter Services Available'!D88<>\"\",CONCATENATE(CHAR(10),CHAR(149),'Enter Services Available'!D88,IF('Enter Services Available'!D89<>\"\",CONCATENATE(CHAR(10),CHAR(149),'Enter Services Available'!D89,IF('Enter Services Available'!D90<>\"\",CONCATENATE(CHAR(10),CHAR(149),'Enter Services Available'!D90),\"\")),\"\")),\"\")),\"\")),\"\")),\"\")),\"\")),\"\")),\"\")),\"\")))","v":""},{"$f":"CONCATENATE(IF('Enter Services Available'!$E$13<>\"Yes\",\"\",IF('Enter Services Available'!D93<>\"\",CONCATENATE(CHAR(149),'Enter Services Available'!D93,IF('Enter Services Available'!D94<>\"\",CONCATENATE(CHAR(10),CHAR(149),'Enter Services Available'!D94,IF('Enter Services Available'!D95<>\"\",CONCATENATE(CHAR(10),CHAR(149),'Enter Services Available'!D95,IF('Enter Services Available'!D96<>\"\",CONCATENATE(CHAR(10),CHAR(149),'Enter Services Available'!D96,IF('Enter Services Available'!D97<>\"\",CONCATENATE(CHAR(10),CHAR(149),'Enter Services Available'!D97,IF('Enter Services Available'!D98<>\"\",CONCATENATE(CHAR(10),CHAR(149),'Enter Services Available'!D98,IF('Enter Services Available'!D99<>\"\",CONCATENATE(CHAR(10),CHAR(149),'Enter Services Available'!D99,IF('Enter Services Available'!D100<>\"\",CONCATENATE(CHAR(10),CHAR(149),'Enter Services Available'!D100,IF('Enter Services Available'!D101<>\"\",CONCATENATE(CHAR(10),CHAR(149),'Enter Services Available'!D101,IF('Enter Services Available'!D102<>\"\",CONCATENATE(CHAR(10),CHAR(149),'Enter Services Available'!D102),\"\")),\"\")),\"\")),\"\")),\"\")),\"\")),\"\")),\"\")),\"\")),\"\")))","v":""},{"$f":"CONCATENATE(IF('Enter Services Available'!$E$15<>\"Yes\",\"\",IF('Enter Services Available'!D105<>\"\",CONCATENATE(CHAR(149),'Enter Services Available'!D105,IF('Enter Services Available'!D106<>\"\",CONCATENATE(CHAR(10),CHAR(149),'Enter Services Available'!D106,IF('Enter Services Available'!D107<>\"\",CONCATENATE(CHAR(10),CHAR(149),'Enter Services Available'!D107,IF('Enter Services Available'!D108<>\"\",CONCATENATE(CHAR(10),CHAR(149),'Enter Services Available'!D108,IF('Enter Services Available'!D109<>\"\",CONCATENATE(CHAR(10),CHAR(149),'Enter Services Available'!D109,IF('Enter Services Available'!D110<>\"\",CONCATENATE(CHAR(10),CHAR(149),'Enter Services Available'!D110,IF('Enter Services Available'!D111<>\"\",CONCATENATE(CHAR(10),CHAR(149),'Enter Services Available'!D111,IF('Enter Services Available'!D112<>\"\",CONCATENATE(CHAR(10),CHAR(149),'Enter Services Available'!D112,IF('Enter Services Available'!D113<>\"\",CONCATENATE(CHAR(10),CHAR(149),'Enter Services Available'!D113,IF('Enter Services Available'!D114<>\"\",CONCATENATE(CHAR(10),CHAR(149),'Enter Services Available'!D114),\"\")),\"\")),\"\")),\"\")),\"\")),\"\")),\"\")),\"\")),\"\")),\"\")))","v":""},null,null,null,null,null,null,null,null,null,null,"24 to 48 months"]
["Education and Skills Training","Services/Activities","Adult Basic Education/ESL","Satisfactory attendance in a secondary school","High School Diploma/GED","Job Skills Training",null,null,"Vocational education (12- month lifetime limit)"]
[null,null,{"$f":"CONCATENATE(IF('Enter Services Available'!$E$17<>\"Yes\",\"\",IF('Enter Services Available'!D117<>\"\",CONCATENATE(CHAR(149),'Enter Services Available'!D117,IF('Enter Services Available'!D118<>\"\",CONCATENATE(CHAR(10),CHAR(149),'Enter Services Available'!D118,IF('Enter Services Available'!D119<>\"\",CONCATENATE(CHAR(10),CHAR(149),'Enter Services Available'!D119,IF('Enter Services Available'!D120<>\"\",CONCATENATE(CHAR(10),CHAR(149),'Enter Services Available'!D120,IF('Enter Services Available'!D121<>\"\",CONCATENATE(CHAR(10),CHAR(149),'Enter Services Available'!D121,IF('Enter Services Available'!D122<>\"\",CONCATENATE(CHAR(10),CHAR(149),'Enter Services Available'!D122,IF('Enter Services Available'!D123<>\"\",CONCATENATE(CHAR(10),CHAR(149),'Enter Services Available'!D123,IF('Enter Services Available'!D124<>\"\",CONCATENATE(CHAR(10),CHAR(149),'Enter Services Available'!D124,IF('Enter Services Available'!D125<>\"\",CONCATENATE(CHAR(10),CHAR(149),'Enter Services Available'!D125,IF('Enter Services Available'!D126<>\"\",CONCATENATE(CHAR(10),CHAR(149),'Enter Services Available'!D126),\"\")),\"\")),\"\")),\"\")),\"\")),\"\")),\"\")),\"\")),\"\")),\"\")))","v":""},null,{"$f":"CONCATENATE(IF('Enter Services Available'!$E$19<>\"Yes\",\"\",IF('Enter Services Available'!D129<>\"\",CONCATENATE(CHAR(149),'Enter Services Available'!D129,IF('Enter Services Available'!D130<>\"\",CONCATENATE(CHAR(10),CHAR(149),'Enter Services Available'!D130,IF('Enter Services Available'!D131<>\"\",CONCATENATE(CHAR(10),CHAR(149),'Enter Services Available'!D131,IF('Enter Services Available'!D132<>\"\",CONCATENATE(CHAR(10),CHAR(149),'Enter Services Available'!D132,IF('Enter Services Available'!D133<>\"\",CONCATENATE(CHAR(10),CHAR(149),'Enter Services Available'!D133,IF('Enter Services Available'!D134<>\"\",CONCATENATE(CHAR(10),CHAR(149),'Enter Services Available'!D134,IF('Enter Services Available'!D135<>\"\",CONCATENATE(CHAR(10),CHAR(149),'Enter Services Available'!D135,IF('Enter Services Available'!D136<>\"\",CONCATENATE(CHAR(10),CHAR(149),'Enter Services Available'!D136,IF('Enter Services Available'!D137<>\"\",CONCATENATE(CHAR(10),CHAR(149),'Enter Services Available'!D137,IF('Enter Services Available'!D138<>\"\",CONCATENATE(CHAR(10),CHAR(149),'Enter Services Available'!D138),\"\")),\"\")),\"\")),\"\")),\"\")),\"\")),\"\")),\"\")),\"\")),\"\")))","v":""},{"$f":"CONCATENATE(IF('Enter Services Available'!$E$21<>\"Yes\",\"\",IF('Enter Services Available'!D141<>\"\",CONCATENATE(CHAR(149),'Enter Services Available'!D141,IF('Enter Services Available'!D142<>\"\",CONCATENATE(CHAR(10),CHAR(149),'Enter Services Available'!D142,IF('Enter Services Available'!D143<>\"\",CONCATENATE(CHAR(10),CHAR(149),'Enter Services Available'!D143,IF('Enter Services Available'!D144<>\"\",CONCATENATE(CHAR(10),CHAR(149),'Enter Services Available'!D144,IF('Enter Services Available'!D145<>\"\",CONCATENATE(CHAR(10),CHAR(149),'Enter Services Available'!D145,IF('Enter Services Available'!D146<>\"\",CONCATENATE(CHAR(10),CHAR(149),'Enter Services Available'!D146,IF('Enter Services Available'!D147<>\"\",CONCATENATE(CHAR(10),CHAR(149),'Enter Services Available'!D147,IF('Enter Services Available'!D148<>\"\",CONCATENATE(CHAR(10),CHAR(149),'Enter Services Available'!D148,IF('Enter Services Available'!D149<>\"\",CONCATENATE(CHAR(10),CHAR(149),'Enter Services Available'!D149,IF('Enter Services Available'!D150<>\"\",CONCATENATE(CHAR(10),CHAR(149),'Enter Services Available'!D150),\"\")),\"\")),\"\")),\"\")),\"\")),\"\")),\"\")),\"\")),\"\")),\"\")))","v":""},null,null,{"$f":"CONCATENATE(IF('Enter Services Available'!$E$23<>\"Yes\",\"\",IF('Enter Services Available'!D153<>\"\",CONCATENATE(CHAR(149),'Enter Services Available'!D153,IF('Enter Services Available'!D154<>\"\",CONCATENATE(CHAR(10),CHAR(149),'Enter Services Available'!D154,IF('Enter Services Available'!D155<>\"\",CONCATENATE(CHAR(10),CHAR(149),'Enter Services Available'!D155,IF('Enter Services Available'!D156<>\"\",CONCATENATE(CHAR(10),CHAR(149),'Enter Services Available'!D156,IF('Enter Services Available'!D157<>\"\",CONCATENATE(CHAR(10),CHAR(149),'Enter Services Available'!D157,IF('Enter Services Available'!D158<>\"\",CONCATENATE(CHAR(10),CHAR(149),'Enter Services Available'!D158,IF('Enter Services Available'!D159<>\"\",CONCATENATE(CHAR(10),CHAR(149),'Enter Services Available'!D159,IF('Enter Services Available'!D160<>\"\",CONCATENATE(CHAR(10),CHAR(149),'Enter Services Available'!D160,IF('Enter Services Available'!D161<>\"\",CONCATENATE(CHAR(10),CHAR(149),'Enter Services Available'!D161,IF('Enter Services Available'!D162<>\"\",CONCATENATE(CHAR(10),CHAR(149),'Enter Services Available'!D162),\"\")),\"\")),\"\")),\"\")),\"\")),\"\")),\"\")),\"\")),\"\")),\"\")))","v":""},null,"Color coding Key For Services and Activities"]
["Child Care","Stage of Support","Stage 1","Stage 2",null,"Stage 3",null,null,null,null,"Can participate without needing to engage in other activities","Can only participate if engaged in other activities"]
["Work Supports","Services/Activities","Transportation","Payment for ancillary expenses",null,null,null,null,null,null,"Can participate in these activities on a time-limited basis w/o needing to engage in other activities  ","Can participate in these activities on time-limited basis & if can't meet hours requirement alone, must be engaged in other activities"]
[null,null,{"$f":"CONCATENATE(IF('Enter Services Available'!$E$25<>\"Yes\",\"\",IF('Enter Services Available'!D165<>\"\",CONCATENATE(CHAR(149),'Enter Services Available'!D165,IF('Enter Services Available'!D166<>\"\",CONCATENATE(CHAR(10),CHAR(149),'Enter Services Available'!D166,IF('Enter Services Available'!D167<>\"\",CONCATENATE(CHAR(10),CHAR(149),'Enter Services Available'!D167,IF('Enter Services Available'!D168<>\"\",CONCATENATE(CHAR(10),CHAR(149),'Enter Services Available'!D168,IF('Enter Services Available'!D169<>\"\",CONCATENATE(CHAR(10),CHAR(149),'Enter Services Available'!D169,IF('Enter Services Available'!D170<>\"\",CONCATENATE(CHAR(10),CHAR(149),'Enter Services Available'!D170,IF('Enter Services Available'!D171<>\"\",CONCATENATE(CHAR(10),CHAR(149),'Enter Services Available'!D171,IF('Enter Services Available'!D172<>\"\",CONCATENATE(CHAR(10),CHAR(149),'Enter Services Available'!D172,IF('Enter Services Available'!D173<>\"\",CONCATENATE(CHAR(10),CHAR(149),'Enter Services Available'!D173,IF('Enter Services Available'!D174<>\"\",CONCATENATE(CHAR(10),CHAR(149),'Enter Services Available'!D174),\"\")),\"\")),\"\")),\"\")),\"\")),\"\")),\"\")),\"\")),\"\")),\"\")))","v":""},{"$f":"CONCATENATE(IF('Enter Services Available'!$E$27<>\"Yes\",\"\",IF('Enter Services Available'!D177<>\"\",CONCATENATE(CHAR(149),'Enter Services Available'!D177,IF('Enter Services Available'!D178<>\"\",CONCATENATE(CHAR(10),CHAR(149),'Enter Services Available'!D178,IF('Enter Services Available'!D179<>\"\",CONCATENATE(CHAR(10),CHAR(149),'Enter Services Available'!D179,IF('Enter Services Available'!D180<>\"\",CONCATENATE(CHAR(10),CHAR(149),'Enter Services Available'!D180,IF('Enter Services Available'!D181<>\"\",CONCATENATE(CHAR(10),CHAR(149),'Enter Services Available'!D181,IF('Enter Services Available'!D182<>\"\",CONCATENATE(CHAR(10),CHAR(149),'Enter Services Available'!D182,IF('Enter Services Available'!D183<>\"\",CONCATENATE(CHAR(10),CHAR(149),'Enter Services Available'!D183,IF('Enter Services Available'!D184<>\"\",CONCATENATE(CHAR(10),CHAR(149),'Enter Services Available'!D184,IF('Enter Services Available'!D185<>\"\",CONCATENATE(CHAR(10),CHAR(149),'Enter Services Available'!D185,IF('Enter Services Available'!D186<>\"\",CONCATENATE(CHAR(10),CHAR(149),'Enter Services Available'!D186),\"\")),\"\")),\"\")),\"\")),\"\")),\"\")),\"\")),\"\")),\"\")),\"\")))","v":""}]
["Personal and Family Needs","Services/Activities","Physical and Mental Health/Substance Abuse Help",null,null,"Family Stabilization Program",null,"Legal Aid",null,null,"Not available in county"]
{"$rows_left_out":3}